{"text_format":"1","workbook":"xlsx","n_sheets":5,"sheets":["Deckblatt","Kurswahl1","Kurswahl2","Persönliche Angaben","Abschluss"],"not_rendered":{"charts":0,"images":4,"macros":1,"external_links":0,"defined_names":0,"comments":1,"pivot_tables":0},"unopened":[],"bounds":{"document_bytes":16777216,"sheet_cells":100000,"rows_first":2000,"rows_last":500,"rows_between":2000,"halvings":0,"cell_chars":16384,"cell_head_chars":4096},"cells_cut":0,"cells_raw":0,"read":"whole","date_system":"1900"}

{"sheet":"Deckblatt","index":0,"n_rows":18,"n_cols":2,"rows_kept":18,"cut":false,"hidden":false,"merged":[[0,1,0,3],[1,1,1,3],[6,0,8,3],[4,0,4,3],[10,0,12,3],[5,0,5,3],[14,0,15,3],[17,0,21,3],[13,0,13,3],[9,0,9,3],[16,0,16,3]]}
[null,"Max -Delbrück-Gymnasium"]
[null,"Wahlen zum Kurssystem"]
[]
[]
["Zum Arbeiten mit der Kurswahltabelle:"]
[]
["1. Stellen Sie sicher, dass Sie die richtige Datei gewählt haben. Für MS Excel nehmen Sie die .xlsm und für OpenOffice die .ods Datei."]
[]
[]
[]
["2. Speichern Sie die Datei in ihren eigenen Dateien bzw. aktivieren Sie das Bearbeiten. Nur dann können Sie diese ausfüllen."]
[]
[]
[]
["3. Zum Verwenden der Buttons müssen Makros aktiviert sein. Bestätigen Sie deren Verwendung."]
{"$rows_left_out":4}
{"sheet":"Kurswahl1","index":1,"n_rows":41,"n_cols":13,"rows_kept":41,"cut":false,"hidden":false,"merged":[[5,0,5,1],[21,0,21,4],[21,5,21,8],[14,0,14,1],[15,0,15,1],[11,0,11,1],[16,0,16,1],[17,0,18,1]]}
[]
[]
[]
[null,null,{"$f":"IF(COUNTIF(C7:C21,\"nicht erfüllt\")>0,\"Nicht alle Bedingungen erfüllt\",\"\")","v":"Nicht alle Bedingungen erfüllt"}]
[null,null,null,null,null,null,null,null,null,"Informatik",null,null,"Darstellendes Spiel"]
["Prüfungsfächer",null,{"$f":"IF(COUNTIF(C7:C11,\" \")=5,\"\",\"Fehlermeldungen\")","v":"Fehlermeldungen"},null,"Aufgabenfeld","Fachbereich","Nur eins","Zwei aus","doppelte Fächer","Info WPU","Fehlermeldung doppeltes Prüfungsfach","Fehlermeldung kein Prüfungsfach gewählt","DS WPU"]
["1. Leistungskursfach",null,{"$f":"\" \"&L7","v":" kein Prüfungsfach gewählt"},"1. Pr.F.",{"$f":"IF($B7=\"\",\"\",VLOOKUP($B7,$F$24:$J$41,2,FALSE))","v":""},{"$f":"IF($B7=\"\",\"\",VLOOKUP($B7,$F$24:$J$41,3,FALSE))","v":""},{"$f":"IF($B7=\"\",\"\",VLOOKUP($B7,$F$24:$J$41,4,FALSE))","v":""},{"$f":"IF($B7=\"\",\"\",VLOOKUP($B7,$F$24:$J$41,5,FALSE))","v":""},{"$f":"COUNTIF($B$7:$B$11,B7)","v":0},null,{"$f":"IF(I7>1,\"Doppeltes Prüfungsfach! Bitte wähle ein anderes!\",\"\")","v":""},{"$f":"IF(B7=\"\",\"kein Prüfungsfach gewählt\",\"\")","v":"kein Prüfungsfach gewählt"}]
["2. Leistungskursfach",null,{"$f":"K8&\" \"&L8","v":" kein Prüfungsfach gewählt"},"2. Pr.F.",{"$f":"IF($B8=\"\",\"\",VLOOKUP($B8,$F$24:$J$41,2,FALSE))","v":""},{"$f":"IF($B8=\"\",\"\",VLOOKUP($B8,$F$24:$J$41,3,FALSE))","v":""},{"$f":"IF($B8=\"\",\"\",VLOOKUP($B8,$F$24:$J$41,4,FALSE))","v":""},{"$f":"IF($B8=\"\",\"\",VLOOKUP($B8,$F$24:$J$41,5,FALSE))","v":""},{"$f":"COUNTIF($B$7:$B$11,B8)","v":0},null,{"$f":"IF(I8>1,\"Doppeltes Prüfungsfach! Bitte wähle ein anderes!\",\"\")","v":""},{"$f":"IF(B8=\"\",\"kein Prüfungsfach gewählt\",\"\")","v":"kein Prüfungsfach gewählt"}]
["3. Prüfungsfach (schriftl.)",null,{"$f":"K9&\" \"&L9","v":" kein Prüfungsfach gewählt"},"3. Pr.F.",{"$f":"IF($B9=\"\",\"\",VLOOKUP($B9,$F$24:$J$41,2,FALSE))","v":""},{"$f":"IF($B9=\"\",\"\",VLOOKUP($B9,$F$24:$J$41,3,FALSE))","v":""},{"$f":"IF($B9=\"\",\"\",VLOOKUP($B9,$F$24:$J$41,4,FALSE))","v":""},{"$f":"IF($B9=\"\",\"\",VLOOKUP($B9,$F$24:$J$41,5,FALSE))","v":""},{"$f":"COUNTIF($B$7:$B$11,B9)","v":0},{"$f":"IF(B9=$J$5,1,0)","v":0},"","kein Prüfungsfach gewählt",{"$f":"IF(B9=$M$5,1,0)","v":0}]
["4. Prüfungsfach (mdl.)",null," kein Prüfungsfach gewählt","4. Pr.F.",{"$f":"IF($B10=\"\",\"\",VLOOKUP($B10,$F$24:$J$41,2,FALSE))","v":""},{"$f":"IF($B10=\"\",\"\",VLOOKUP($B10,$F$24:$J$41,3,FALSE))","v":""},{"$f":"IF($B10=\"\",\"\",VLOOKUP($B10,$F$24:$J$41,4,FALSE))","v":""},{"$f":"IF($B10=\"\",\"\",VLOOKUP($B10,$F$24:$J$41,5,FALSE))","v":""},{"$f":"COUNTIF($B$7:$B$11,B10)","v":0},{"$f":"IF(B10=$J$5,1,0)","v":0},"","kein Prüfungsfach gewählt",{"$f":"IF(B10=$M$5,1,0)","v":0}]
["5. Prüfungskomponente",null," kein Prüfungsfach gewählt","5. Pk.",{"$f":"IF($B11=\"\",\"\",VLOOKUP($B11,$F$24:$J$41,2,FALSE))","v":""},{"$f":"IF($B11=\"\",\"\",VLOOKUP($B11,$F$24:$J$41,3,FALSE))","v":""},{"$f":"IF($B11=\"\",\"\",VLOOKUP($B11,$F$24:$J$41,4,FALSE))","v":""},{"$f":"IF($B11=\"\",\"\",VLOOKUP($B11,$F$24:$J$41,5,FALSE))","v":""},{"$f":"COUNTIF($B$7:$B$11,B11)","v":0},null,"","kein Prüfungsfach gewählt"]
["Verpflichtungen:",null,null,null,{"$f":"IF(COUNTIF(E7:E10,G24)>0,1)+IF(COUNTIF(E7:E10,G36)>0,1)+IF(COUNTIF(E7:E10,G27)>0,1)","v":0},{"$f":"COUNTIF($F$7:$F$11,\"1. Aufgabenfeld\")","v":0},{"$f":"COUNTIF(G9:G10,\"MKDS\")","v":0},{"$f":"COUNTIF(H7:H11,\"ZA\")","v":0},{"$f":"COUNTIF(I7:I11,1)","v":0},{"$f":"SUM(J7:J11)","v":0},null,null,{"$f":"SUM(M7:M11)","v":0}]
["alle Prüfungsfächer ausgewählt",null,{"$f":"IF(COUNTIF(L7:L11,\"\")=5,\"erfüllt\",\"nicht erfüllt\")","v":"nicht erfüllt"},null,null,{"$f":"COUNTIF($F$7:$F$11,\"2. Aufgabenfeld\")","v":0}]
["zwei Prüfungsfächer aus dem Bereich DE, einer FS und MA im 1. - 4. PF",null,{"$f":"IF(E12>1,\"erfüllt\",\"nicht erfüllt\")","v":"nicht erfüllt"},null,null,{"$f":"COUNTIF($F$7:$F$11,\"3. Aufgabenfeld\")","v":0}]
["mindestens ein Prüfungsfach oder 5. PK pro Aufgabenfeld",null,{"$f":"IF(COUNTIF($F$12:$F$14,0)<1,\"erfüllt\",\"nicht erfüllt\")","v":"nicht erfüllt"}]
{"$rows_left_out":27}
{"sheet":"Kurswahl2","index":2,"n_rows":61,"n_cols":37,"rows_kept":61,"cut":false,"hidden":false,"merged":[[6,24,6,27],[8,15,8,19],[18,15,18,19],[22,15,22,19],[49,14,49,15],[25,14,28,19],[46,18,47,18],[46,14,46,15],[47,14,47,15],[48,14,48,15],[21,15,21,19],[39,14,39,19],[37,0,48,0],[23,3,23,6],[30,3,30,6],[35,3,35,6],[7,9,7,12],[9,0,16,0],[19,0,22,0],[25,0,29,0],[32,0,33,0],[9,9,9,12],[7,3,7,6],[18,9,18,12],[25,9,25,12],[38,7,45,7],[4,24,4,27],[2,24,2,27],[17,3,17,6],[6,0,6,7],[16,15,16,19],[17,15,17,19],[6,9,6,12],[6,14,6,19],[10,15,10,19],[9,15,9,19],[7,15,7,19],[11,15,11,19],[15,15,15,19],[14,15,14,19],[13,15,13,19],[12,15,12,19]]}
[]
[]
[null,null,null,null,null,null,null,null,null,null,null,null,null,null,null,null,null,null,null,null,null,null,null,null,"Warnmeldung: 1 = zuviele Kurse",null,null,null,"Zsfsg."]
[null,null,null,null,null,null,null,null,null,null,null,null,null,null,null,null,null,null,null,{"$f":"IF(COUNTIF(Kurswahl2!$O$8:$O$22,\"nicht erfüllt\")<1,\"\",\"formale Bedingungen nicht vollständig erfüllt\")","v":"formale Bedingungen nicht vollständig erfüllt"},null,null,null,null,{"$f":"IF(Y6>10,1,0)","v":0},{"$f":"IF(Z6>10,1,0)","v":0},0,0,{"$f":"SUM(Y4:AB4)","v":0}]
[null,null,null,null,null,null,null,null,null,null,null,null,null,null,null,null,null,null,null,null,null,null,null,null,"#Kurse/Semester"]
[null,null,null,null,null,null,null,null,null,null,null,null,null,null,null,null,null,null,null,null,null,null,null,null,{"$f":"COUNTIF(Y18:Y36,\"WAHR\")+COUNTIF(Y11:Y16,\"WAHR\")","v":0},{"$f":"COUNTIF(Z18:Z36,\"WAHR\")+COUNTIF(Z11:Z16,\"WAHR\")","v":0},{"$f":"COUNTIF(AA18:AA36,\"WAHR\")+COUNTIF(AA11:AA16,\"WAHR\")","v":0},{"$f":"COUNTIF(AB18:AB36,\"WAHR\")+COUNTIF(AB11:AB16,\"WAHR\")","v":0}]
["Übersicht",null,null,null,null,null,null,null,null,"Wahlboxen",null,null,null,null,"Verpflichtungen",null,null,null,null,null,null,"Verpflichtungen erfüllt?",null,null,"Wahlboxverknüpfungen",null,null,null,null,"LK Kurse","GK Kurse",null," Prüfung 2 Semester hintereinander?","Prüfung das Fächer blockweise belegt werden","Kurse nicht einzeln in Q2 oder 4 gewählt"]
[null,null,null,"Semester",null,null,null,null,null,"Semester",null,null,null,null,{"$f":"IF(V8=1,\"erfüllt\",\"nicht erfüllt\")","v":"nicht erfüllt"},"Prüfungsfächerwahl möglich",null,null,null,null,null,{"$f":"IF(COUNTIF(Kurswahl1!C13:C16,\"erfüllt\")=4,1,0)","v":0},null,null,"hier wird nur ausgegeben, was der Schüler vorne"]
[null,"Fach","Pr.fach","1.","2.","3.","4.","einbringbar",null,"1.","2.","3.","4.",null,"erfüllt","Deutsch vier Semester",null,null,null,null,null,{"$f":"IF(H10=4,1,0)","v":1},null,null,"angekreuzt hat, um damit weiterzuarbeiten"]
["1. AF","Deutsch",{"$f":"IF(COUNTIF(Kurswahl1!$B$7:$B$11,Kurswahl2!B10)>0,VLOOKUP(B10,Kurswahl1!$B$7:$D$11,3,FALSE),\"\")","v":""},"x","x","x","x",4,null,null,null,null,null,null,"nicht erfüllt","eine Fremdsprache vier Semester",null,null,null,null,null,{"$f":"IF(H13=4,1,IF(H14=4,1,IF(H15=4,1,IF(H16=4,1,0))))","v":0},null,null,null,null,null,null,null,{"$f":"IF(C10=\"1. Pr.F.\",H10,IF(C10=\"2. Pr.F.\",H10,0))","v":0},{"$f":"IF(C10=\"1. Pr.F.\",0,IF(C10=\"2. Pr.F.\",0,H10))","v":4},null,null,null,"Kurse im Semester","zulässig??","zulässige Kurskombinationen"]
[null,"Musik",{"$f":"IF(COUNTIF(Kurswahl1!$B$7:$B$11,Kurswahl2!B11)>0,VLOOKUP(B11,Kurswahl1!$B$7:$D$11,3,FALSE),\"\")","v":""},{"$f":"IF($C11<>\"\",\"x\",IF(Y11=TRUE,\"x\",\"\"))","v":""},"","","",{"$f":"COUNTIF(D11:G11,\"x\")","v":0},null,null,null,null,null,null,"erfüllt","Mathematik vier Semester",null,null,null,null,null,{"$f":"IF(H26=4,1,0)","v":1},null,null,false,false,false,false,null,0,0,null,{"$f":"IF(COUNTIF(D11:E11,\"x\")=2,1,IF(COUNTIF(F11:G11,\"x\")=2,1,0))","v":0},{"$f":"IF(AND(Y11=Z11,AA11=AB11),1,0)","v":1},{"$f":"IF(Y11=TRUE,1,\"\")&IF(Z11=TRUE,2,\"\")&IF(AA11=TRUE,3,\"\")&IF(AB11=TRUE,4,\"\")","v":""},{"$f":"IF(AI11=\"\",1,COUNTIF($AK$11:$AK$16,AI11))","v":1},1234]
[null,"Kunst",{"$f":"IF(COUNTIF(Kurswahl1!$B$7:$B$11,Kurswahl2!B12)>0,VLOOKUP(B12,Kurswahl1!$B$7:$D$11,3,FALSE),\"\")","v":""},"","","","",{"$f":"COUNTIF(D12:G12,\"x\")","v":0},null,null,null,null,null,null,"nicht erfüllt","eine NaWi (Ph, Ch, Bio) vier Semester",null,null,null,null,null,{"$f":"IF(H27=4,1,IF(H28=4,1,IF(H29=4,1,0)))","v":0},null,null,false,false,false,false,null,0,0,null,{"$f":"IF(COUNTIF(D12:E12,\"x\")=2,1,IF(COUNTIF(F12:G12,\"x\")=2,1,0))","v":0},{"$f":"IF(AND(Y12=Z12,AA12=AB12),1,0)","v":1},{"$f":"IF(Y12=TRUE,1,\"\")&IF(Z12=TRUE,2,\"\")&IF(AA12=TRUE,3,\"\")&IF(AB12=TRUE,4,\"\")","v":""},{"$f":"IF(AI12=\"\",1,COUNTIF($AK$11:$AK$16,AI12))","v":1},123]
[null,"Englisch",{"$f":"IF(COUNTIF(Kurswahl1!$B$7:$B$11,Kurswahl2!B13)>0,VLOOKUP(B13,Kurswahl1!$B$7:$D$11,3,FALSE),\"\")","v":""},"","","","",0,null,null,null,null,null,null,"nicht erfüllt","Ph o. Ch zwei Semester hintereinander (blockweise)",null,null,null,null,null,{"$f":"IF(SUM(AG27:AG28)>0,1,0)","v":0},null,null,false,false,false,false,null,0,0,null,null,1,"",1,234]
[null,"Französisch",{"$f":"IF(COUNTIF(Kurswahl1!$B$7:$B$11,Kurswahl2!B14)>0,VLOOKUP(B14,Kurswahl1!$B$7:$D$11,3,FALSE),\"\")","v":""},"","","","",0,null,null,null,null,null,null,"nicht erfüllt","GeWi-Regelung",null,null,null,null,null,{"$f":"IF(W54+W55=2,1,0)","v":0},null,null,false,false,false,false,null,0,0,null,null,1,"",1,12]
[null,"Latein",{"$f":"IF(COUNTIF(Kurswahl1!$B$7:$B$11,Kurswahl2!B15)>0,VLOOKUP(B15,Kurswahl1!$B$7:$D$11,3,FALSE),\"\")","v":""},"","","","",0,null,null,null,null,null,null,"nicht erfüllt","Mu, Ku oder DS mindestens zwei Semester hintereinander (blockweise)",null,null,null,null,null,{"$f":"IF(AG11+AG12+AG17>0,1,0)","v":0},null,null,false,false,false,false,null,0,0,null,null,1,"",1,34]
{"$rows_left_out":47}
{"sheet":"Persönliche Angaben","index":3,"n_rows":111,"n_cols":19,"rows_kept":111,"cut":false,"hidden":false,"merged":[[10,1,10,3],[14,1,14,3],[5,1,5,3],[17,1,17,3],[0,7,0,13]]}
[null,null,null,null,null,null,null,"Dropdown-Profilierungskurse (roter Bereich aus Kursübersicht der Profilierungskurse -> Mittelstufenkoordinator oder Qualitätsbeauftragten fragen)"]
[null,null,null,null,null,null,null,"funktioniert ergänzbar im blauen Bereich",null,null,"P8","P9","P10","Titel","P8lfdNr.","P9lfdNr.","P10lfdNr.",{"$f":"M2","v":"P10"},{"$f":"N2","v":"Titel"}]
[null,null,null,null,null,null,null,null,null,null,"P8TH1","P9TH1","-","Pantomime/ Masken ",{"$f":"IF(OR(K3=\"-\",K3=\"\"),\"\",MAX(O$1:O2)+1)","v":1},{"$f":"IF(OR(L3=\"-\",L3=\"\"),\"\",MAX(P$1:P2)+1)","v":1},{"$f":"IF(OR(M3=\"-\",M3=\"\"),\"\",MAX(Q$1:Q2)+1)","v":""},{"$f":"M3","v":"-"},{"$f":"N3","v":"Pantomime/ Masken "}]
[null,null,null,null,null,null,null,"Liste bis Zeile 100 funktionsfähig",null,null,"-","P9TH2","P10TH2","Improvisationstheater",{"$f":"IF(OR(K4=\"-\",K4=\"\"),\"\",MAX(O$1:O3)+1)","v":""},{"$f":"IF(OR(L4=\"-\",L4=\"\"),\"\",MAX(P$1:P3)+1)","v":2},{"$f":"IF(OR(M4=\"-\",M4=\"\"),\"\",MAX(Q$1:Q3)+1)","v":1},"P10TH2","Improvisationstheater"]
[null,null,null,null,null,null,1,{"$f":"IF(G5=\"\",\"\",VLOOKUP(G5,$Q$3:$S$102,2,FALSE)&\" - \"&VLOOKUP(G5,$Q$3:$S$102,3,FALSE))","v":"P10TH2 - Improvisationstheater"},null,null,"P8DE1","P9DE1","P10DE1","Die innere Bühne - Aktivwerkstatt Hörspiel/-feature",{"$f":"IF(OR(K5=\"-\",K5=\"\"),\"\",MAX(O$1:O4)+1)","v":2},{"$f":"IF(OR(L5=\"-\",L5=\"\"),\"\",MAX(P$1:P4)+1)","v":3},{"$f":"IF(OR(M5=\"-\",M5=\"\"),\"\",MAX(Q$1:Q4)+1)","v":2},"P10DE1","Die innere Bühne - Aktivwerkstatt Hörspiel/-feature"]
[null,"Persönliche Angaben",null,null,null,null,{"$f":"IF(OR(G5=MAX(Q3:Q102),G5=\"\"),\"\",MAX($G$4:G5)+1)","v":2},{"$f":"IF(G6=\"\",\"\",VLOOKUP(G6,$Q$3:$S$102,2,FALSE)&\" - \"&VLOOKUP(G6,$Q$3:$S$102,3,FALSE))","v":"P10DE1 - Die innere Bühne - Aktivwerkstatt Hörspiel/-feature"},null,null,"P8DE2","P9DE2","P10DE2","Maximal Report (Jugendpresse des MDGs)",{"$f":"IF(OR(K6=\"-\",K6=\"\"),\"\",MAX(O$1:O5)+1)","v":3},{"$f":"IF(OR(L6=\"-\",L6=\"\"),\"\",MAX(P$1:P5)+1)","v":4},{"$f":"IF(OR(M6=\"-\",M6=\"\"),\"\",MAX(Q$1:Q5)+1)","v":3},"P10DE2","Maximal Report (Jugendpresse des MDGs)"]
[null,null,"Name",null,null,null,{"$f":"IF(OR(G6=MAX(Q4:Q103),G6=\"\"),\"\",MAX($G$4:G6)+1)","v":3},"P10DE2 - Maximal Report (Jugendpresse des MDGs)",null,null,"P8DE3","P9DE3","-","Bücherbörse",{"$f":"IF(OR(K7=\"-\",K7=\"\"),\"\",MAX(O$1:O6)+1)","v":4},{"$f":"IF(OR(L7=\"-\",L7=\"\"),\"\",MAX(P$1:P6)+1)","v":5},{"$f":"IF(OR(M7=\"-\",M7=\"\"),\"\",MAX(Q$1:Q6)+1)","v":""},"-","Bücherbörse"]
[null,null,"Vorname(n!)",null,null,null,{"$f":"IF(OR(G7=MAX(Q5:Q104),G7=\"\"),\"\",MAX($G$4:G7)+1)","v":4},"P10DE4 - Buchstabenbaustelle, Textwerkstatt, Literaturschmiede",null,null,"P8DE4","P9DE4","P10DE4","Buchstabenbaustelle, Textwerkstatt, Literaturschmiede",{"$f":"IF(OR(K8=\"-\",K8=\"\"),\"\",MAX(O$1:O7)+1)","v":5},{"$f":"IF(OR(L8=\"-\",L8=\"\"),\"\",MAX(P$1:P7)+1)","v":6},{"$f":"IF(OR(M8=\"-\",M8=\"\"),\"\",MAX(Q$1:Q7)+1)","v":4},"P10DE4","Buchstabenbaustelle, Textwerkstatt, Literaturschmiede"]
[null,null,"Geburtstag",null,null,null,{"$f":"IF(OR(G8=MAX(Q6:Q105),G8=\"\"),\"\",MAX($G$4:G8)+1)","v":5},"P10DE5 - MDG Satiregipfel",null,null,"P8DE5","P9DE5","P10DE5","MDG Satiregipfel",{"$f":"IF(OR(K9=\"-\",K9=\"\"),\"\",MAX(O$1:O8)+1)","v":6},{"$f":"IF(OR(L9=\"-\",L9=\"\"),\"\",MAX(P$1:P8)+1)","v":7},{"$f":"IF(OR(M9=\"-\",M9=\"\"),\"\",MAX(Q$1:Q8)+1)","v":5},"P10DE5","MDG Satiregipfel"]
[null,null,"Geburtsort",null,null,null,{"$f":"IF(OR(G9=MAX(Q7:Q106),G9=\"\"),\"\",MAX($G$4:G9)+1)","v":6},"P10EN1 - Of detectives, wizards and robots - come and join the fantastic world of reading",null,null,"P8EN1","-","P10EN1","Of detectives, wizards and robots - come and join the fantastic world of reading",{"$f":"IF(OR(K10=\"-\",K10=\"\"),\"\",MAX(O$1:O9)+1)","v":7},{"$f":"IF(OR(L10=\"-\",L10=\"\"),\"\",MAX(P$1:P9)+1)","v":""},{"$f":"IF(OR(M10=\"-\",M10=\"\"),\"\",MAX(Q$1:Q9)+1)","v":6},"P10EN1","Of detectives, wizards and robots - come and join the fantastic world of reading"]
[null,"Angaben zu Fremdsprachen",null,null,null,null,{"$f":"IF(OR(G10=MAX(Q8:Q107),G10=\"\"),\"\",MAX($G$4:G10)+1)","v":7},"P10EN3 - Speaking English! Making friends! Discussing our digital life!",null,null,"P8EN2","-","-","come and join the fantastic world of writing",{"$f":"IF(OR(K11=\"-\",K11=\"\"),\"\",MAX(O$1:O10)+1)","v":8},{"$f":"IF(OR(L11=\"-\",L11=\"\"),\"\",MAX(P$1:P10)+1)","v":""},{"$f":"IF(OR(M11=\"-\",M11=\"\"),\"\",MAX(Q$1:Q10)+1)","v":""},"-","come and join the fantastic world of writing"]
[null,null,"1. FS","Englisch",null,null,{"$f":"IF(OR(G11=MAX(Q9:Q108),G11=\"\"),\"\",MAX($G$4:G11)+1)","v":8},"P10EN4 - What's fair in fairtrade?",null,null,"-","P9EN3","P10EN3","Speaking English! Making friends! Discussing our digital life!",{"$f":"IF(OR(K12=\"-\",K12=\"\"),\"\",MAX(O$1:O11)+1)","v":""},{"$f":"IF(OR(L12=\"-\",L12=\"\"),\"\",MAX(P$1:P11)+1)","v":8},{"$f":"IF(OR(M12=\"-\",M12=\"\"),\"\",MAX(Q$1:Q11)+1)","v":7},"P10EN3","Speaking English! Making friends! Discussing our digital life!"]
[null,null,"2. FS (ab 7. Klasse)",null,null,null,{"$f":"IF(OR(G12=MAX(Q10:Q109),G12=\"\"),\"\",MAX($G$4:G12)+1)","v":9},"P10EN5 - How the world was discovered",null,null,"P8EN4","P9EN4","P10EN4","What's fair in fairtrade?",{"$f":"IF(OR(K13=\"-\",K13=\"\"),\"\",MAX(O$1:O12)+1)","v":9},{"$f":"IF(OR(L13=\"-\",L13=\"\"),\"\",MAX(P$1:P12)+1)","v":9},{"$f":"IF(OR(M13=\"-\",M13=\"\"),\"\",MAX(Q$1:Q12)+1)","v":8},"P10EN4","What's fair in fairtrade?"]
[null,null,"3. FS (ab 9. Klasse)",null,null,null,{"$f":"IF(OR(G13=MAX(Q11:Q110),G13=\"\"),\"\",MAX($G$4:G13)+1)","v":10},"P10EK3 - Wir verbessern die Welt (OSM)",null,null,"P8EN5","P9EN5","P10EN5","How the world was discovered",{"$f":"IF(OR(K14=\"-\",K14=\"\"),\"\",MAX(O$1:O13)+1)","v":10},{"$f":"IF(OR(L14=\"-\",L14=\"\"),\"\",MAX(P$1:P13)+1)","v":10},{"$f":"IF(OR(M14=\"-\",M14=\"\"),\"\",MAX(Q$1:Q13)+1)","v":9},"P10EN5","How the world was discovered"]
[null,"Angaben zu Wahlpflicht",null,null,null,null,{"$f":"IF(OR(G14=MAX(Q12:Q111),G14=\"\"),\"\",MAX($G$4:G14)+1)","v":11},"P10FS1 - Bundeswettbewerb für Fremdsprachen (Französisch, Spanisch)",null,null,"P8EK1","-","-","Auf Entdeckungsreise zu den weitgehend unerforschten Gebieten",{"$f":"IF(OR(K15=\"-\",K15=\"\"),\"\",MAX(O$1:O14)+1)","v":11},{"$f":"IF(OR(L15=\"-\",L15=\"\"),\"\",MAX(P$1:P14)+1)","v":""},{"$f":"IF(OR(M15=\"-\",M15=\"\"),\"\",MAX(Q$1:Q14)+1)","v":""},"-","Auf Entdeckungsreise zu den weitgehend unerforschten Gebieten"]
{"$rows_left_out":97}
{"sheet":"Abschluss","index":4,"n_rows":56,"n_cols":8,"rows_kept":56,"cut":false,"hidden":false,"merged":[[44,7,50,7],[35,7,36,7],[1,1,1,7],[40,2,40,5],[41,2,41,5],[7,2,7,5]]}
[null,"Kurswahl / MDG / Vers. 2.1 (Jan 2021)"]
[null,{"$f":"IF(COUNTIF(Kurswahl2!$O$8:$O$21,\"nicht erfüllt\")<1,\"\",\"formale Bedingungen nicht vollständig erfüllt\")","v":"formale Bedingungen nicht vollständig erfüllt"}]
[null,"Name:",{"$f":"'Persönliche Angaben'!D8&\" \"&'Persönliche Angaben'!D7","v":" "},null,null,null,{"$f":"'Persönliche Angaben'!D9","v":"00:00:00"},{"$f":"'Persönliche Angaben'!D10","v":0}]
[]
["1. Fremdspr:",{"$f":"IF('Persönliche Angaben'!D12=\"\",\"-\",'Persönliche Angaben'!D12)","v":"Englisch"},"2. Fremdspr.",{"$f":"IF('Persönliche Angaben'!D13=\"\",\"-\",'Persönliche Angaben'!D13)","v":"-"},"3. Fremdspr.",{"$f":"IF('Persönliche Angaben'!D14=\"\",\"-\",'Persönliche Angaben'!D14)","v":"-"}]
["WP10 Fach 1:",{"$f":"IF('Persönliche Angaben'!D16=\"\",\"-\",'Persönliche Angaben'!D16)","v":"-"},"WP10 Fach 2:",{"$f":"IF('Persönliche Angaben'!D17=\"\",\"-\",'Persönliche Angaben'!D17)","v":"-"},"P10 Kurs 1:",{"$f":"IF('Persönliche Angaben'!D19=\"\",\"-\",'Persönliche Angaben'!D19)","v":"ab 2021"},"P10 Kurs 2:",{"$f":"IF('Persönliche Angaben'!D20=\"\",\"-\",'Persönliche Angaben'!D20)","v":"-"}]
[]
["1. Aufgabenfeld",null,"Semester"]
["Fach","Pr.fach","1.","2.","3.","4.","belegt","einbringbar"]
["Deutsch",{"$f":"IF(Kurswahl2!C10=\"\",\"\",Kurswahl2!C10)","v":""},{"$f":"IF(Kurswahl2!D10=\"\",\"\",Kurswahl2!D10)","v":"x"},{"$f":"IF(Kurswahl2!E10=\"\",\"\",Kurswahl2!E10)","v":"x"},{"$f":"IF(Kurswahl2!F10=\"\",\"\",Kurswahl2!F10)","v":"x"},{"$f":"IF(Kurswahl2!G10=\"\",\"\",Kurswahl2!G10)","v":"x"},{"$f":"IF(Kurswahl2!H10=\"\",\"\",Kurswahl2!H10)","v":4},{"$f":"G10","v":4}]
["Musik",{"$f":"IF(Kurswahl2!C11=\"\",\"\",Kurswahl2!C11)","v":""},{"$f":"IF(Kurswahl2!D11=\"\",\"\",Kurswahl2!D11)","v":""},{"$f":"IF(Kurswahl2!E11=\"\",\"\",Kurswahl2!E11)","v":""},{"$f":"IF(Kurswahl2!F11=\"\",\"\",Kurswahl2!F11)","v":""},{"$f":"IF(Kurswahl2!G11=\"\",\"\",Kurswahl2!G11)","v":""},{"$f":"IF(Kurswahl2!H11=\"\",\"\",Kurswahl2!H11)","v":0},{"$f":"G11","v":0}]
["Kunst",{"$f":"IF(Kurswahl2!C12=\"\",\"\",Kurswahl2!C12)","v":""},{"$f":"IF(Kurswahl2!D12=\"\",\"\",Kurswahl2!D12)","v":""},{"$f":"IF(Kurswahl2!E12=\"\",\"\",Kurswahl2!E12)","v":""},{"$f":"IF(Kurswahl2!F12=\"\",\"\",Kurswahl2!F12)","v":""},{"$f":"IF(Kurswahl2!G12=\"\",\"\",Kurswahl2!G12)","v":""},{"$f":"IF(Kurswahl2!H12=\"\",\"\",Kurswahl2!H12)","v":0},0]
["Englisch",{"$f":"IF(Kurswahl2!C13=\"\",\"\",Kurswahl2!C13)","v":""},{"$f":"IF(Kurswahl2!D13=\"\",\"\",Kurswahl2!D13)","v":""},{"$f":"IF(Kurswahl2!E13=\"\",\"\",Kurswahl2!E13)","v":""},{"$f":"IF(Kurswahl2!F13=\"\",\"\",Kurswahl2!F13)","v":""},{"$f":"IF(Kurswahl2!G13=\"\",\"\",Kurswahl2!G13)","v":""},{"$f":"IF(Kurswahl2!H13=\"\",\"\",Kurswahl2!H13)","v":0},0]
["Französisch",{"$f":"IF(Kurswahl2!C14=\"\",\"\",Kurswahl2!C14)","v":""},{"$f":"IF(Kurswahl2!D14=\"\",\"\",Kurswahl2!D14)","v":""},{"$f":"IF(Kurswahl2!E14=\"\",\"\",Kurswahl2!E14)","v":""},{"$f":"IF(Kurswahl2!F14=\"\",\"\",Kurswahl2!F14)","v":""},{"$f":"IF(Kurswahl2!G14=\"\",\"\",Kurswahl2!G14)","v":""},{"$f":"IF(Kurswahl2!H14=\"\",\"\",Kurswahl2!H14)","v":0},0]
["Latein",{"$f":"IF(Kurswahl2!C15=\"\",\"\",Kurswahl2!C15)","v":""},{"$f":"IF(Kurswahl2!D15=\"\",\"\",Kurswahl2!D15)","v":""},{"$f":"IF(Kurswahl2!E15=\"\",\"\",Kurswahl2!E15)","v":""},{"$f":"IF(Kurswahl2!F15=\"\",\"\",Kurswahl2!F15)","v":""},{"$f":"IF(Kurswahl2!G15=\"\",\"\",Kurswahl2!G15)","v":""},{"$f":"IF(Kurswahl2!H15=\"\",\"\",Kurswahl2!H15)","v":0},0]
{"$rows_left_out":41}